Reaction Details
Target17-beta-hydroxysteroid dehydrogenase type 3
LigandBDBM50111763
Substrate/Competitorn/a
Meas. Tech.ChEMBL_1510493 (CHEMBL3607519)
IC50 28±n/a nM
Citation Djigoué, GBKenmogne, LCRoy, JMaltais, RPoirier, D Design, chemical synthesis and biological evaluation of 3-spiromorpholinone/3-spirocarbamate androsterone derivatives as inhibitors of 17ß-hydroxysteroid dehydrogenase type 3. Bioorg Med Chem23:5433-51 (2015) 
 
17-beta-hydroxysteroid dehydrogenase type 3
Name:17-beta-hydroxysteroid dehydrogenase type 3
Type:PROTEIN
Mol. Mass.:34235.73
Organism:Rattus norvegicus
Description:ChEMBL_1510493
Residue:306
BDBM50111763
NameBDBM50111763
Synonyms:CHEMBL3605211
TypeSmall organic molecule
Emp. Form.C29H36F3NO5S
Mol. Mass.567.66
SMILES[H][C@@]12CCC(=O)[C@@]1(C)CC[C@@]1([H])[C@@]2([H])CC[C@@]2([H])C[C@]3(CC[C@]12C)CN(CC(=O)O3)S(=O)(=O)c1ccc(cc1)C(F)(F)F