Reaction Details
Target17-beta-hydroxysteroid dehydrogenase type 3
LigandBDBM17639
Substrate/Competitorn/a
Meas. Tech.ChEMBL_1510493 (CHEMBL3607519)
IC50 90±n/a nM
Citation Djigoué, GBKenmogne, LCRoy, JMaltais, RPoirier, D Design, chemical synthesis and biological evaluation of 3-spiromorpholinone/3-spirocarbamate androsterone derivatives as inhibitors of 17ß-hydroxysteroid dehydrogenase type 3. Bioorg Med Chem23:5433-51 (2015) 
 
17-beta-hydroxysteroid dehydrogenase type 3
Name:17-beta-hydroxysteroid dehydrogenase type 3
Type:PROTEIN
Mol. Mass.:34235.73
Organism:Rattus norvegicus
Description:ChEMBL_1510493
Residue:306
BDBM17639
NameBDBM17639
Synonyms:(1S,2S,5R,7S,10R,11S,15S)-5-hydroxy-2,15-dimethyltetracyclo[8.7.0.0^{2,7}.0^{11,15}]heptadecan-14-one CHEMBL87285
TypeSteroid
Emp. Form.C19H30O2
Mol. Mass.290.4403
SMILES[H][C@@]12CCC(=O)[C@@]1(C)CC[C@@]1([H])[C@@]2([H])CC[C@@]2([H])C[C@H](O)CC[C@]12C