Reaction Details
TargetAmine oxidase [flavin-containing] A
LigandBDBM50317203
Substrate/Competitorn/a
Meas. Tech.ChEMBL_1510679 (CHEMBL3606165)
IC50>150000±n/a nM
Citation Otto, RPenzis, RGaube, FAdolph, OFöhr, KJWarncke, PRobaa, DAppenroth, DFleck, CEnzensperger, CLehmann, JWinckler, T Evaluation of Homobivalent Carbolines as Designed Multiple Ligands for the Treatment of Neurodegenerative Disorders. J Med Chem58:6710-5 (2015) 
 
Amine oxidase [flavin-containing] A
Name:Amine oxidase [flavin-containing] A
Type:Protein
Mol. Mass.:59689.53
Organism:Homo sapiens (Human)
Description:P21397
Residue:527
BDBM50317203
NameBDBM50317203
Synonyms:9-[9-(beta-Carboline-9-yl)nonyl]-beta-carboline | CHEMBL1098471
TypeSmall organic molecule
Emp. Form.C31H32N4
Mol. Mass.460.6126
SMILESC(CCCCn1c2ccccc2c2ccncc12)CCCCn1c2ccccc2c2ccncc12