Reaction Details
TargetAmine oxidase [flavin-containing] A
LigandBDBM50317193
Substrate/Competitorn/a
Meas. Tech.ChEMBL_1510679 (CHEMBL3606165)
IC50>150000±n/a nM
Citation Otto, RPenzis, RGaube, FAdolph, OFöhr, KJWarncke, PRobaa, DAppenroth, DFleck, CEnzensperger, CLehmann, JWinckler, T Evaluation of Homobivalent Carbolines as Designed Multiple Ligands for the Treatment of Neurodegenerative Disorders. J Med Chem58:6710-5 (2015) 
 
Amine oxidase [flavin-containing] A
Name:Amine oxidase [flavin-containing] A
Type:Protein
Mol. Mass.:59689.53
Organism:Homo sapiens (Human)
Description:P21397
Residue:527
BDBM50317193
NameBDBM50317193
Synonyms:2-Methyl-9-[9-(2-methyl-1,2,3,4-tetrahydro-beta-carboline-9-yl)nonyl]-1,2,3,4-tetrahydro-beta-carboline | CHEMBL1087459
TypeSmall organic molecule
Emp. Form.C33H44N4
Mol. Mass.496.7293
SMILESCN1CCc2c(C1)n(CCCCCCCCCn1c3CN(C)CCc3c3ccccc13)c1ccccc21