Reaction Details
TargetAmine oxidase [flavin-containing] A
LigandBDBM50111775
Substrate/Competitorn/a
Meas. Tech.ChEMBL_1510679 (CHEMBL3606165)
IC50 250±n/a nM
Citation Otto, RPenzis, RGaube, FAdolph, OFöhr, KJWarncke, PRobaa, DAppenroth, DFleck, CEnzensperger, CLehmann, JWinckler, T Evaluation of Homobivalent Carbolines as Designed Multiple Ligands for the Treatment of Neurodegenerative Disorders. J Med Chem58:6710-5 (2015) 
 
Amine oxidase [flavin-containing] A
Name:Amine oxidase [flavin-containing] A
Type:Protein
Mol. Mass.:59689.53
Organism:Homo sapiens (Human)
Description:P21397
Residue:527
BDBM50111775
NameBDBM50111775
Synonyms:CHEMBL3605360
TypeSmall organic molecule
Emp. Form.C32H36I2N4
Mol. Mass.730.464
SMILES[I-].[I-].C[n+]1ccc2n(CCCCCCCCn3c4ccccc4c4c[n+](C)ccc34)c3ccccc3c2c1