Reaction Details
TargetAmine oxidase [flavin-containing] A
LigandBDBM50111785
Substrate/Competitorn/a
Meas. Tech.ChEMBL_1510679 (CHEMBL3606165)
IC50 6300±n/a nM
Citation Otto, RPenzis, RGaube, FAdolph, OFöhr, KJWarncke, PRobaa, DAppenroth, DFleck, CEnzensperger, CLehmann, JWinckler, T Evaluation of Homobivalent Carbolines as Designed Multiple Ligands for the Treatment of Neurodegenerative Disorders. J Med Chem58:6710-5 (2015) 
 
Amine oxidase [flavin-containing] A
Name:Amine oxidase [flavin-containing] A
Type:Protein
Mol. Mass.:59689.53
Organism:Homo sapiens (Human)
Description:P21397
Residue:527
BDBM50111785
NameBDBM50111785
Synonyms:CHEMBL3605370
TypeSmall organic molecule
Emp. Form.C35H48N4O2
Mol. Mass.556.7812
SMILESCOc1ccc2n(CCCCCCCCCn3c4CCN(C)Cc4c4cc(OC)ccc34)c3CCN(C)Cc3c2c1