Reaction Details
TargetAmine oxidase [flavin-containing] B
LigandBDBM50111768
Substrate/Competitorn/a
Meas. Tech.ChEMBL_1510680 (CHEMBL3606166)
IC50 7100±n/a nM
Citation Otto, RPenzis, RGaube, FAdolph, OFöhr, KJWarncke, PRobaa, DAppenroth, DFleck, CEnzensperger, CLehmann, JWinckler, T Evaluation of Homobivalent Carbolines as Designed Multiple Ligands for the Treatment of Neurodegenerative Disorders. J Med Chem58:6710-5 (2015) 
 
Amine oxidase [flavin-containing] B
Name:Amine oxidase [flavin-containing] B
Type:Protein
Mol. Mass.:58768.76
Organism:Homo sapiens (Human)
Description:P27338
Residue:520
BDBM50111768
NameBDBM50111768
Synonyms:CHEMBL3605353
TypeSmall organic molecule
Emp. Form.C28H26N4
Mol. Mass.418.5328
SMILESC(CCCn1c2ccccc2c2cnccc12)CCn1c2ccccc2c2cnccc12