Reaction Details
TargetAmine oxidase [flavin-containing] B
LigandBDBM50111774
Substrate/Competitorn/a
Meas. Tech.ChEMBL_1510680 (CHEMBL3606166)
IC50 51±n/a nM
Citation Otto, RPenzis, RGaube, FAdolph, OFöhr, KJWarncke, PRobaa, DAppenroth, DFleck, CEnzensperger, CLehmann, JWinckler, T Evaluation of Homobivalent Carbolines as Designed Multiple Ligands for the Treatment of Neurodegenerative Disorders. J Med Chem58:6710-5 (2015) 
 
Amine oxidase [flavin-containing] B
Name:Amine oxidase [flavin-containing] B
Type:Protein
Mol. Mass.:58768.76
Organism:Homo sapiens (Human)
Description:P27338
Residue:520
BDBM50111774
NameBDBM50111774
Synonyms:CHEMBL3605359
TypeSmall organic molecule
Emp. Form.C31H34I2N4
Mol. Mass.716.4374
SMILES[I-].[I-].C[n+]1ccc2n(CCCCCCCn3c4ccccc4c4c[n+](C)ccc34)c3ccccc3c2c1