Reaction Details
TargetCholinesterase
LigandBDBM50111772
Substrate/Competitorn/a
Meas. Tech.ChEMBL_1510667 (CHEMBL3608118)
IC50 6.5±n/a nM
Citation Otto, RPenzis, RGaube, FAdolph, OFöhr, KJWarncke, PRobaa, DAppenroth, DFleck, CEnzensperger, CLehmann, JWinckler, T Evaluation of Homobivalent Carbolines as Designed Multiple Ligands for the Treatment of Neurodegenerative Disorders. J Med Chem58:6710-5 (2015) 
 
Cholinesterase
Name:Cholinesterase
Type:Enzyme
Mol. Mass.:65643.35
Organism:Equus caballus (Horse)
Description:P81908
Residue:574
BDBM50111772
NameBDBM50111772
Synonyms:CHEMBL3605357
TypeSmall organic molecule
Emp. Form.C33H36N4O2
Mol. Mass.520.6645
SMILESCOc1ccc2n(CCCCCCCCCn3c4ccncc4c4cc(OC)ccc34)c3ccncc3c2c1