Reaction Details
TargetAcetylcholinesterase
LigandBDBM50111784
Substrate/Competitorn/a
Meas. Tech.ChEMBL_1510666 (CHEMBL3608117)
IC50 17±n/a nM
Citation Otto, RPenzis, RGaube, FAdolph, OFöhr, KJWarncke, PRobaa, DAppenroth, DFleck, CEnzensperger, CLehmann, JWinckler, T Evaluation of Homobivalent Carbolines as Designed Multiple Ligands for the Treatment of Neurodegenerative Disorders. J Med Chem58:6710-5 (2015) 
 
Acetylcholinesterase
Name:Acetylcholinesterase
Type:Enzyme
Mol. Mass.:71812.79
Organism:Electrophorus electricus (Electric eel)
Description:n/a
Residue:633
BDBM50111784
NameBDBM50111784
Synonyms:CHEMBL3605369
TypeSmall organic molecule
Emp. Form.C33H44N4
Mol. Mass.496.7293
SMILESCN1CCc2c(C1)c1ccccc1n2CCCCCCCCCn1c2CCN(C)Cc2c2ccccc12