Reaction Details
TargetAcetylcholinesterase
LigandBDBM50111780
Substrate/Competitorn/a
Meas. Tech.ChEMBL_1510666 (CHEMBL3608117)
IC50 3.1±n/a nM
Citation Otto, RPenzis, RGaube, FAdolph, OFöhr, KJWarncke, PRobaa, DAppenroth, DFleck, CEnzensperger, CLehmann, JWinckler, T Evaluation of Homobivalent Carbolines as Designed Multiple Ligands for the Treatment of Neurodegenerative Disorders. J Med Chem58:6710-5 (2015) 
 
Acetylcholinesterase
Name:Acetylcholinesterase
Type:Enzyme
Mol. Mass.:71812.79
Organism:Electrophorus electricus (Electric eel)
Description:n/a
Residue:633
BDBM50111780
NameBDBM50111780
Synonyms:CHEMBL3605365
TypeSmall organic molecule
Emp. Form.C37H46I2N4
Mol. Mass.800.5969
SMILES[I-].[I-].CCC[n+]1ccc2n(CCCCCCCCCn3c4ccccc4c4c[n+](CCC)ccc34)c3ccccc3c2c1