Reaction Details
TargetAcetylcholinesterase
LigandBDBM50111777
Substrate/Competitorn/a
Meas. Tech.ChEMBL_1510666 (CHEMBL3608117)
IC50 4.1±n/a nM
Citation Otto, RPenzis, RGaube, FAdolph, OFöhr, KJWarncke, PRobaa, DAppenroth, DFleck, CEnzensperger, CLehmann, JWinckler, T Evaluation of Homobivalent Carbolines as Designed Multiple Ligands for the Treatment of Neurodegenerative Disorders. J Med Chem58:6710-5 (2015) 
 
Acetylcholinesterase
Name:Acetylcholinesterase
Type:Enzyme
Mol. Mass.:71812.79
Organism:Electrophorus electricus (Electric eel)
Description:n/a
Residue:633
BDBM50111777
NameBDBM50111777
Synonyms:CHEMBL3605362
TypeSmall organic molecule
Emp. Form.C35H42I2N4O2
Mol. Mass.804.5425
SMILES[I-].[I-].COc1ccc2n(CCCCCCCCCn3c4ccc(OC)cc4c4c[n+](C)ccc34)c3cc[n+](C)cc3c2c1