Reaction Details
TargetAcetylcholinesterase
LigandBDBM50111773
Substrate/Competitorn/a
Meas. Tech.ChEMBL_1510666 (CHEMBL3608117)
IC50 15±n/a nM
Citation Otto, RPenzis, RGaube, FAdolph, OFöhr, KJWarncke, PRobaa, DAppenroth, DFleck, CEnzensperger, CLehmann, JWinckler, T Evaluation of Homobivalent Carbolines as Designed Multiple Ligands for the Treatment of Neurodegenerative Disorders. J Med Chem58:6710-5 (2015) 
 
Acetylcholinesterase
Name:Acetylcholinesterase
Type:Enzyme
Mol. Mass.:71812.79
Organism:Electrophorus electricus (Electric eel)
Description:n/a
Residue:633
BDBM50111773
NameBDBM50111773
Synonyms:CHEMBL3605358
TypeSmall organic molecule
Emp. Form.C30H32I2N4
Mol. Mass.702.4108
SMILES[I-].[I-].C[n+]1ccc2n(CCCCCCn3c4ccccc4c4c[n+](C)ccc34)c3ccccc3c2c1