Reaction Details
TargetAcetylcholinesterase
LigandBDBM50317193
Substrate/Competitorn/a
Meas. Tech.ChEMBL_1510666 (CHEMBL3608117)
IC50 17±n/a nM
Citation Otto, RPenzis, RGaube, FAdolph, OFöhr, KJWarncke, PRobaa, DAppenroth, DFleck, CEnzensperger, CLehmann, JWinckler, T Evaluation of Homobivalent Carbolines as Designed Multiple Ligands for the Treatment of Neurodegenerative Disorders. J Med Chem58:6710-5 (2015) 
 
Acetylcholinesterase
Name:Acetylcholinesterase
Type:Enzyme
Mol. Mass.:71812.79
Organism:Electrophorus electricus (Electric eel)
Description:n/a
Residue:633
BDBM50317193
NameBDBM50317193
Synonyms:2-Methyl-9-[9-(2-methyl-1,2,3,4-tetrahydro-beta-carboline-9-yl)nonyl]-1,2,3,4-tetrahydro-beta-carboline | CHEMBL1087459
TypeSmall organic molecule
Emp. Form.C33H44N4
Mol. Mass.496.7293
SMILESCN1CCc2c(C1)n(CCCCCCCCCn1c3CN(C)CCc3c3ccccc13)c1ccccc21