Reaction Details
TargetIsocitrate dehydrogenase [NADP] cytoplasmic
LigandBDBM50111790
Substrate/Competitorn/a
Meas. Tech.ChEMBL_1510683 (CHEMBL3606169)
Ki 4800±n/a nM
Citation Wu, FJiang, HZheng, BKogiso, MYao, YZhou, CLi, XNSong, Y Inhibition of Cancer-Associated Mutant Isocitrate Dehydrogenases by 2-Thiohydantoin Compounds. J Med Chem58:6899-908 (2015) 
 
Isocitrate dehydrogenase [NADP] cytoplasmic
Name:Isocitrate dehydrogenase [NADP] cytoplasmic
Type:Protein
Mol. Mass.:46661.29
Organism:Homo sapiens (Human)
Description:O75874
Residue:414
BDBM50111790
NameBDBM50111790
Synonyms:CHEMBL3605378
TypeSmall organic molecule
Emp. Form.C16H13N3O2S
Mol. Mass.311.358
SMILESO=C1N(Cc2ccccc2)C(=S)N\C1=C\c1ccc(=O)[nH]c1