Reaction Details
TargetIsocitrate dehydrogenase [NADP] cytoplasmic
LigandBDBM50111976
Substrate/Competitorn/a
Meas. Tech.ChEMBL_1510683 (CHEMBL3606169)
Ki 2600±n/a nM
Citation Wu, FJiang, HZheng, BKogiso, MYao, YZhou, CLi, XNSong, Y Inhibition of Cancer-Associated Mutant Isocitrate Dehydrogenases by 2-Thiohydantoin Compounds. J Med Chem58:6899-908 (2015) 
 
Isocitrate dehydrogenase [NADP] cytoplasmic
Name:Isocitrate dehydrogenase [NADP] cytoplasmic
Type:Protein
Mol. Mass.:46661.29
Organism:Homo sapiens (Human)
Description:O75874
Residue:414
BDBM50111976
NameBDBM50111976
Synonyms:CHEMBL3605396
TypeSmall organic molecule
Emp. Form.C11H11N3O2S
Mol. Mass.249.289
SMILESCOc1cc(\C=C2\NC(=S)N(C)C2=O)ccn1