Reaction Details
TargetMuscarinic acetylcholine receptor M1
LigandBDBM50112163
Substrate/Competitorn/a
Meas. Tech.ChEMBL_1512946 (CHEMBL3609985)
EC50 14±n/a nM
Citation Blass, B Pyrrolopyridine or Pyrazolopyridine Derivatives. ACS Med Chem Lett6:726-8 (2015) 
 
Muscarinic acetylcholine receptor M1
Name:Muscarinic acetylcholine receptor M1
Type:Enzyme Catalytic Domain
Mol. Mass.:51390.46
Organism:RAT
Description:P08482
Residue:460
BDBM50112163
NameBDBM50112163
Synonyms:CHEMBL3608419
TypeSmall organic molecule
Emp. Form.C24H25N5O3
Mol. Mass.431.487
SMILESCn1cc(cn1)-c1ccc(Cn2cc(C(=O)N[C@H]3COCC[C@@H]3O)c3ncccc23)cc1