Reaction Details
TargetSerine/threonine-protein kinase PAK 6
LigandBDBM50112350
Substrate/Competitorn/a
Meas. Tech.ChEMBL_1513233 (CHEMBL3610941)
Kd>40000±n/a nM
Citation Karpov, ASAmiri, PBellamacina, CBellance, MHBreitenstein, WDaniel, DDenay, RFabbro, DFernandez, CGaluba, IGuerro-Lagasse, SGutmann, SHinh, LJahnke, WKlopp, JLai, ALindvall, MKMa, SMöbitz, HPecchi, SRummel, GShoemaker, KTrappe, JVoliva, CCowan-Jacob, SWMarzinzik, AL Optimization of a Dibenzodiazepine Hit to a Potent and Selective Allosteric PAK1 Inhibitor. ACS Med Chem Lett6:776-81 (2015) 
 
Serine/threonine-protein kinase PAK 6
Name:Serine/threonine-protein kinase PAK 6
Type:PROTEIN
Mol. Mass.:74897.61
Organism:Homo sapiens (Human)
Description:ChEMBL_1513397
Residue:681
BDBM50112350
NameBDBM50112350
Synonyms:CHEMBL3609370
TypeSmall organic molecule
Emp. Form.C24H28ClFN4O2
Mol. Mass.458.956
SMILESCCN1c2ccc(F)cc2N=C(N[C@H]2CCN(C2)C(=O)OC(C)(C)C)c2cc(Cl)ccc12