Reaction Details
TargetSerine/threonine-protein kinase PAK 1
LigandBDBM50112353
Substrate/Competitorn/a
Meas. Tech.ChEMBL_1513227 (CHEMBL3610935)
IC50 6000±n/a nM
Citation Karpov, ASAmiri, PBellamacina, CBellance, MHBreitenstein, WDaniel, DDenay, RFabbro, DFernandez, CGaluba, IGuerro-Lagasse, SGutmann, SHinh, LJahnke, WKlopp, JLai, ALindvall, MKMa, SMöbitz, HPecchi, SRummel, GShoemaker, KTrappe, JVoliva, CCowan-Jacob, SWMarzinzik, AL Optimization of a Dibenzodiazepine Hit to a Potent and Selective Allosteric PAK1 Inhibitor. ACS Med Chem Lett6:776-81 (2015) 
 
Serine/threonine-protein kinase PAK 1
Name:Serine/threonine-protein kinase PAK 1
Type:n/a
Mol. Mass.:60640.15
Organism:Homo sapiens (Human)
Description:Q13153
Residue:545
BDBM50112353
NameBDBM50112353
Synonyms:CHEMBL3609329
TypeSmall organic molecule
Emp. Form.C19H20ClFN4
Mol. Mass.358.84
SMILESCN1CCN(CC1)C1=Nc2cc(F)ccc2N(C)c2ccc(Cl)cc12