Reaction Details
TargetSerine/threonine-protein kinase PAK 6
LigandBDBM50112354
Substrate/Competitorn/a
Meas. Tech.ChEMBL_1513397 (CHEMBL3611552)
IC50>10000±n/a nM
Citation Karpov, ASAmiri, PBellamacina, CBellance, MHBreitenstein, WDaniel, DDenay, RFabbro, DFernandez, CGaluba, IGuerro-Lagasse, SGutmann, SHinh, LJahnke, WKlopp, JLai, ALindvall, MKMa, SMöbitz, HPecchi, SRummel, GShoemaker, KTrappe, JVoliva, CCowan-Jacob, SWMarzinzik, AL Optimization of a Dibenzodiazepine Hit to a Potent and Selective Allosteric PAK1 Inhibitor. ACS Med Chem Lett6:776-81 (2015) 
 
Serine/threonine-protein kinase PAK 6
Name:Serine/threonine-protein kinase PAK 6
Type:PROTEIN
Mol. Mass.:74897.61
Organism:Homo sapiens (Human)
Description:ChEMBL_1513397
Residue:681
BDBM50112354
NameBDBM50112354
Synonyms:CHEMBL472940
TypeSmall organic molecule
Emp. Form.C20H14O2S2
Mol. Mass.350.454
SMILESOc1ccc2ccccc2c1SSc1c(O)ccc2ccccc12