Reaction Details
TargetSerine/threonine-protein kinase PAK 2
LigandBDBM50112355
Substrate/Competitorn/a
Meas. Tech.ChEMBL_1513391 (CHEMBL3611546)
IC50 40±n/a nM
Citation Karpov, ASAmiri, PBellamacina, CBellance, MHBreitenstein, WDaniel, DDenay, RFabbro, DFernandez, CGaluba, IGuerro-Lagasse, SGutmann, SHinh, LJahnke, WKlopp, JLai, ALindvall, MKMa, SMöbitz, HPecchi, SRummel, GShoemaker, KTrappe, JVoliva, CCowan-Jacob, SWMarzinzik, AL Optimization of a Dibenzodiazepine Hit to a Potent and Selective Allosteric PAK1 Inhibitor. ACS Med Chem Lett6:776-81 (2015) 
 
Serine/threonine-protein kinase PAK 2
Name:Serine/threonine-protein kinase PAK 2
Type:Enzyme
Mol. Mass.:58037.40
Organism:Homo sapiens (Human)
Description:Q13177
Residue:524
BDBM50112355
NameBDBM50112355
Synonyms:CHEMBL3609326
TypeSmall organic molecule
Emp. Form.C25H23Cl2FN6O
Mol. Mass.513.394
SMILESCCn1c2nc(Nc3ccc(N4CCNCC4)c(F)c3)ncc2cc(-c2ccc(Cl)cc2Cl)c1=O