Reaction Details
TargetReceptor-type tyrosine-protein phosphatase epsilon
LigandBDBM50112356
Substrate/Competitorn/a
Meas. Tech.ChEMBL_1513406 (CHEMBL3611561)
IC50>50000±n/a nM
Citation He, RYu, ZHZhang, RYWu, LGunawan, AMLane, BSShim, JSZeng, LFHe, YChen, LWells, CDLiu, JOZhang, ZY Exploring the Existing Drug Space for Novel pTyr Mimetic and SHP2 Inhibitors. ACS Med Chem Lett6:782-6 (2015) 
 
Receptor-type tyrosine-protein phosphatase epsilon
Name:Receptor-type tyrosine-protein phosphatase epsilon
Type:Protein
Mol. Mass.:80646.31
Organism:Homo sapiens (Human)
Description:P23469
Residue:700
BDBM50112356
NameBDBM50112356
Synonyms:CHEMBL3609373
TypeSmall organic molecule
Emp. Form.C22H18IN3O6S
Mol. Mass.579.364
SMILESOS(=O)(=O)C(C(=O)Nc1ccc(NC(=O)C(=O)Nc2ccc(I)cc2)cc1)c1ccccc1