Reaction Details
TargetNuclear receptor ROR-gamma
LigandBDBM50112359
Substrate/Competitorn/a
Meas. Tech.ChEMBL_1513553 (CHEMBL3610010)
IC50 6.3±n/a nM
Citation Wang, YCai, WCheng, YYang, TLiu, QZhang, GMeng, QHan, FHuang, YZhou, LXiang, ZZhao, YGXu, YCheng, ZLu, SWu, QXiang, JNElliott, JDLeung, SRen, FLin, X Discovery of Biaryl Amides as Potent, Orally Bioavailable, and CNS Penetrant ROR¿t Inhibitors. ACS Med Chem Lett6:787-92 (2015) 
 
Nuclear receptor ROR-gamma
Name:Nuclear receptor ROR-gamma
Type:Enzyme Catalytic Domain
Mol. Mass.:58218.40
Organism:Homo sapiens (Human)
Description:P51449
Residue:518
BDBM50112359
NameBDBM50112359
Synonyms:CHEMBL3609415
TypeSmall organic molecule
Emp. Form.C23H18Cl2F3NO4S
Mol. Mass.532.36
SMILESCCS(=O)(=O)c1ccc(CC(=O)Nc2ccc(c(Cl)c2)-c2ccc(Cl)cc2OC(F)(F)F)cc1