Reaction Details
TargetNuclear receptor ROR-gamma
LigandBDBM50112586
Substrate/Competitorn/a
Meas. Tech.ChEMBL_1513553 (CHEMBL3610010)
IC50 5.0±n/a nM
Citation Wang, YCai, WCheng, YYang, TLiu, QZhang, GMeng, QHan, FHuang, YZhou, LXiang, ZZhao, YGXu, YCheng, ZLu, SWu, QXiang, JNElliott, JDLeung, SRen, FLin, X Discovery of Biaryl Amides as Potent, Orally Bioavailable, and CNS Penetrant ROR¿t Inhibitors. ACS Med Chem Lett6:787-92 (2015) 
 
Nuclear receptor ROR-gamma
Name:Nuclear receptor ROR-gamma
Type:Enzyme Catalytic Domain
Mol. Mass.:58218.40
Organism:Homo sapiens (Human)
Description:P51449
Residue:518
BDBM50112586
NameBDBM50112586
Synonyms:CHEMBL3609399
TypeSmall organic molecule
Emp. Form.C24H22F3NO4S
Mol. Mass.477.496
SMILESCCS(=O)(=O)c1ccc(CC(=O)Nc2ccc(c(C)c2)-c2ccccc2OC(F)(F)F)cc1