Reaction Details
TargetNuclear receptor ROR-gamma
LigandBDBM50112590
Substrate/Competitorn/a
Meas. Tech.ChEMBL_1513553 (CHEMBL3610010)
IC50 7.9±n/a nM
Citation Wang, YCai, WCheng, YYang, TLiu, QZhang, GMeng, QHan, FHuang, YZhou, LXiang, ZZhao, YGXu, YCheng, ZLu, SWu, QXiang, JNElliott, JDLeung, SRen, FLin, X Discovery of Biaryl Amides as Potent, Orally Bioavailable, and CNS Penetrant ROR¿t Inhibitors. ACS Med Chem Lett6:787-92 (2015) 
 
Nuclear receptor ROR-gamma
Name:Nuclear receptor ROR-gamma
Type:Enzyme Catalytic Domain
Mol. Mass.:58218.40
Organism:Homo sapiens (Human)
Description:P51449
Residue:518
BDBM50112590
NameBDBM50112590
Synonyms:CHEMBL3609397
TypeSmall organic molecule
Emp. Form.C23H20F3NO4S
Mol. Mass.463.469
SMILESCCS(=O)(=O)c1ccc(CC(=O)Nc2ccc(cc2)-c2ccccc2OC(F)(F)F)cc1