Reaction Details
TargetDiscoidin domain-containing receptor 2
LigandBDBM50112613
Substrate/Competitorn/a
Meas. Tech.ChEMBL_1513724 (CHEMBL3610834)
IC50 280±n/a nM
Citation Murray, CWBerdini, VBuck, IMCarr, MECleasby, ACoyle, JECurry, JEDay, JEDay, PJHearn, KIqbal, ALee, LYMartins, VMortenson, PNMunck, JMPage, LWPatel, SRoomans, SSmith, KTamanini, ESaxty, G Fragment-Based Discovery of Potent and Selective DDR1/2 Inhibitors. ACS Med Chem Lett6:798-803 (2015) 
 
Discoidin domain-containing receptor 2
Name:Discoidin domain-containing receptor 2
Type:Protein
Mol. Mass.:96717.07
Organism:Homo sapiens (Human)
Description:Q16832
Residue:855
BDBM50112613
NameBDBM50112613
Synonyms:CHEMBL3608784
TypeSmall organic molecule
Emp. Form.C22H19N5O2
Mol. Mass.385.4186
SMILESO=C(NCc1cccc(NC(=O)c2cnc3ccccn23)c1)Nc1ccccc1