Reaction Details
TargetEpithelial discoidin domain-containing receptor 1
LigandBDBM50112624
Substrate/Competitorn/a
Meas. Tech.ChEMBL_1513726 (CHEMBL3610836)
IC50 1500±n/a nM
Citation Murray, CWBerdini, VBuck, IMCarr, MECleasby, ACoyle, JECurry, JEDay, JEDay, PJHearn, KIqbal, ALee, LYMartins, VMortenson, PNMunck, JMPage, LWPatel, SRoomans, SSmith, KTamanini, ESaxty, G Fragment-Based Discovery of Potent and Selective DDR1/2 Inhibitors. ACS Med Chem Lett6:798-803 (2015) 
 
Epithelial discoidin domain-containing receptor 1
Name:Epithelial discoidin domain-containing receptor 1
Type:Tyrosine-protein kinase
Mol. Mass.:101130.02
Organism:Homo sapiens (Human)
Description:Q08345
Residue:913
BDBM50112624
NameBDBM50112624
Synonyms:CHEMBL3608788
TypeSmall organic molecule
Emp. Form.C24H23N5O2
Mol. Mass.413.4717
SMILESC[C@@H](NC(=O)Nc1ccccc1)c1ccc(C)c(NC(=O)c2cnc3ccccn23)c1