Reaction Details
TargetMast/stem cell growth factor receptor Kit
LigandBDBM50112618
Substrate/Competitorn/a
Meas. Tech.ChEMBL_1513844 (CHEMBL3611266)
IC50 310±n/a nM
Citation Murray, CWBerdini, VBuck, IMCarr, MECleasby, ACoyle, JECurry, JEDay, JEDay, PJHearn, KIqbal, ALee, LYMartins, VMortenson, PNMunck, JMPage, LWPatel, SRoomans, SSmith, KTamanini, ESaxty, G Fragment-Based Discovery of Potent and Selective DDR1/2 Inhibitors. ACS Med Chem Lett6:798-803 (2015) 
 
Mast/stem cell growth factor receptor Kit
Name:Mast/stem cell growth factor receptor Kit
Type:Protein
Mol. Mass.:109869.37
Organism:Homo sapiens (Human)
Description:P10721
Residue:976
BDBM50112618
NameBDBM50112618
Synonyms:CHEMBL3608787
TypeSmall organic molecule
Emp. Form.C24H23N5O2
Mol. Mass.413.4717
SMILESC[C@H](NC(=O)Nc1ccccc1)c1ccc(C)c(NC(=O)c2cnc3ccccn23)c1