Reaction Details
TargetCarbonic anhydrase 9
LigandBDBM50112645
Substrate/Competitorn/a
Meas. Tech.ChEMBL_1513881 (CHEMBL3611446)
Ki 86±n/a nM
Citation Ombouma, JVullo, DDumy, PSupuran, CTWinum, JY Carbonic Anhydrase Glycoinhibitors belonging to the Aminoxysulfonamide Series. ACS Med Chem Lett6:819-21 (2015) 
 
Carbonic anhydrase 9
Name:Carbonic anhydrase 9
Type:Enzyme
Mol. Mass.:49669.03
Organism:Homo sapiens (Human)
Description:Catalytic domain of human cloned isozyme was used in the assay
Residue:459
BDBM50112645
NameBDBM50112645
Synonyms:CHEMBL3609435
TypeSmall organic molecule
Emp. Form.C7H12N2O6S
Mol. Mass.252.245
SMILESCC(=O)O[C@H]1COC(NS(=O)(=O)ON)C=C1