Reaction Details
TargetCarbonic anhydrase 9
LigandBDBM50112759
Substrate/Competitorn/a
Meas. Tech.ChEMBL_1513881 (CHEMBL3611446)
Ki 86±n/a nM
Citation Ombouma, JVullo, DDumy, PSupuran, CTWinum, JY Carbonic Anhydrase Glycoinhibitors belonging to the Aminoxysulfonamide Series. ACS Med Chem Lett6:819-21 (2015) 
 
Carbonic anhydrase 9
Name:Carbonic anhydrase 9
Type:Enzyme
Mol. Mass.:49669.03
Organism:Homo sapiens (Human)
Description:Catalytic domain of human cloned isozyme was used in the assay
Residue:459
BDBM50112759
NameBDBM50112759
Synonyms:CHEMBL3609436
TypeSmall organic molecule
Emp. Form.C8H14N2O6S
Mol. Mass.266.272
SMILESC[C@@H]1OC(NS(=O)(=O)ON)C=C[C@H]1OC(C)=O