Reaction Details
TargetCarbonic anhydrase 9
LigandBDBM50112760
Substrate/Competitorn/a
Meas. Tech.ChEMBL_1513881 (CHEMBL3611446)
Ki 85±n/a nM
Citation Ombouma, JVullo, DDumy, PSupuran, CTWinum, JY Carbonic Anhydrase Glycoinhibitors belonging to the Aminoxysulfonamide Series. ACS Med Chem Lett6:819-21 (2015) 
 
Carbonic anhydrase 9
Name:Carbonic anhydrase 9
Type:Enzyme
Mol. Mass.:49669.03
Organism:Homo sapiens (Human)
Description:Catalytic domain of human cloned isozyme was used in the assay
Residue:459
BDBM50112760
NameBDBM50112760
Synonyms:CHEMBL3608320
TypeSmall organic molecule
Emp. Form.C6H12N2O6S
Mol. Mass.240.234
SMILESNOS(=O)(=O)NC1O[C@H](CO)[C@@H](O)C=C1