Reaction Details
TargetCarbonic anhydrase 1
LigandBDBM50112768
Substrate/Competitorn/a
Meas. Tech.ChEMBL_1513879 (CHEMBL3611444)
Ki 60±n/a nM
Citation Ombouma, JVullo, DDumy, PSupuran, CTWinum, JY Carbonic Anhydrase Glycoinhibitors belonging to the Aminoxysulfonamide Series. ACS Med Chem Lett6:819-21 (2015) 
 
Carbonic anhydrase 1
Name:Carbonic anhydrase 1
Type:Enzyme
Mol. Mass.:28873.37
Organism:Homo sapiens (Human)
Description:P00915
Residue:261
BDBM50112768
NameBDBM50112768
Synonyms:CHEMBL3609440
TypeSmall organic molecule
Emp. Form.C6H12N2O5S
Mol. Mass.224.235
SMILESC[C@@H]1OC(NS(=O)(=O)ON)C=C[C@H]1O