Reaction Details
TargetDNA topoisomerase 4 subunit A/B
LigandBDBM50112815
Substrate/Competitorn/a
Meas. Tech.ChEMBL_1513891 (CHEMBL3611456)
Ki 59.0±n/a nM
Citation O'Dowd, HShannon, DEChandupatla, KRDixit, VEngtrakul, JJYe, ZJones, SMO'Brien, CFNicolau, DPTessier, PRCrandon, JLSong, BMacikenas, DHanzelka, BLLe Tiran, ABennani, YLCharifson, PSGrillot, AL Discovery and Characterization of a Water-Soluble Prodrug of a Dual Inhibitor of Bacterial DNA Gyrase and Topoisomerase IV. ACS Med Chem Lett6:822-6 (2015) 
 
DNA topoisomerase 4 subunit A/B
Name:DNA topoisomerase 4 subunit A/B
Synonyms:Topoisomerase IV
Type:n/a
Mol. Mass.:n/a
Description:ASSAY_ID of ChEMBL is 2012758
Components:This complex has 2 components.
Component 1
Name:DNA topoisomerase 4 subunit A
Type:PROTEIN
Mol. Mass.:91040.14
Organism:Staphylococcus aureus
Description:ChEMBL_340188
Residue:800
Component 2
Name:DNA topoisomerase 4 subunit B
Synonyms:DNA topoisomerase 4 subunit B PARE_STAA8 grlB | parE
Type:Enzyme
Mol. Mass.:74365.92
Organism:Staphylococcus aureus
Description:Q2FYS5
Residue:663
BDBM50112815
NameBDBM50112815
Synonyms:CHEMBL2221212
TypeSmall organic molecule
Emp. Form.C21H26FN6O6P
Mol. Mass.508.4399
SMILESCCNC(=O)Nc1nc2cc(c(F)c([C@H]3CCCO3)c2[nH]1)-c1cnc(nc1)C(C)(C)OP(O)(O)=O