Reaction Details
TargetLIP1, secretory lipase (Family 3)
LigandBDBM50112883
Substrate/Competitorn/a
Meas. Tech.ChEMBL_1512200 (CHEMBL3611482)
IC50 20090±n/a nM
Citation Guo, SHuang, WZhang, JWang, Y Novel inhibitor against Malassezia globosa LIP1 (SMG1), a potential anti-dandruff target. Bioorg Med Chem Lett25:3464-7 (2015) 
 
LIP1, secretory lipase (Family 3)
Name:LIP1, secretory lipase (Family 3)
Synonyms:LIP1, secretory lipase (Family 3)
Type:PROTEIN
Mol. Mass.:33701.74
Organism:Malassezia globosa (strain ATCC MYA-4612 / CBS 7966)(Dandruff-associated fungus)
Description:ChEMBL_109860
Residue:304
BDBM50112883
NameBDBM50112883
Synonyms:CHEMBL3609530
TypeSmall organic molecule
Emp. Form.C17H22N2OS2
Mol. Mass.334.499
SMILESO=C1N(CCSC(=S)N2CCCCCC2)Cc2ccccc12