Reaction Details
TargetLIP1, secretory lipase (Family 3)
LigandBDBM50112884
Substrate/Competitorn/a
Meas. Tech.ChEMBL_1512200 (CHEMBL3611482)
IC50 81750±n/a nM
Citation Guo, SHuang, WZhang, JWang, Y Novel inhibitor against Malassezia globosa LIP1 (SMG1), a potential anti-dandruff target. Bioorg Med Chem Lett25:3464-7 (2015) 
 
LIP1, secretory lipase (Family 3)
Name:LIP1, secretory lipase (Family 3)
Synonyms:LIP1, secretory lipase (Family 3)
Type:PROTEIN
Mol. Mass.:33701.74
Organism:Malassezia globosa (strain ATCC MYA-4612 / CBS 7966)(Dandruff-associated fungus)
Description:ChEMBL_109860
Residue:304
BDBM50112884
NameBDBM50112884
Synonyms:CHEMBL3609531
TypeSmall organic molecule
Emp. Form.C18H14O3
Mol. Mass.278.302
SMILESCc1ccc(cc1)C(=O)Oc1ccc2ccc(O)cc2c1