Reaction Details
TargetCytochrome P450 1A1
LigandBDBM50432677
Substrate/Competitorn/a
Meas. Tech.ChEMBL_1508786 (CHEMBL3603195)
Ki 270±n/a nM
Citation Liu, JPham, PTSkripnikova, EVZheng, SLovings, LJWang, YGoyal, NBellow, SMMensah, LMChatters, AJBratton, MRWiese, TEZhao, MWang, GForoozesh, M A Ligand-Based Drug Design. Discovery of 4-Trifluoromethyl-7,8-pyranocoumarin as a Selective Inhibitor of Human Cytochrome P450 1A2. J Med Chem58:6481-93 (2015) 
 
Cytochrome P450 1A1
Name:Cytochrome P450 1A1
Type:Protein
Mol. Mass.:58177.23
Organism:Homo sapiens (Human)
Description:P04798
Residue:512
BDBM50432677
NameBDBM50432677
Synonyms:CHEMBL2347756
TypeSmall organic molecule
Emp. Form.C18H12O3
Mol. Mass.276.2861
SMILESO=c1cc(oc2c3C=CCOc3ccc12)-c1ccccc1