Reaction Details
TargetCytochrome P450 1A1
LigandBDBM50113268
Substrate/Competitorn/a
Meas. Tech.ChEMBL_1508786 (CHEMBL3603195)
Ki 60600±n/a nM
Citation Liu, JPham, PTSkripnikova, EVZheng, SLovings, LJWang, YGoyal, NBellow, SMMensah, LMChatters, AJBratton, MRWiese, TEZhao, MWang, GForoozesh, M A Ligand-Based Drug Design. Discovery of 4-Trifluoromethyl-7,8-pyranocoumarin as a Selective Inhibitor of Human Cytochrome P450 1A2. J Med Chem58:6481-93 (2015) 
 
Cytochrome P450 1A1
Name:Cytochrome P450 1A1
Type:Protein
Mol. Mass.:58177.23
Organism:Homo sapiens (Human)
Description:P04798
Residue:512
BDBM50113268
NameBDBM50113268
Synonyms:CHEMBL3601440
TypeSmall organic molecule
Emp. Form.C13H7F3O3
Mol. Mass.268.1881
SMILESFC(F)(F)c1cc(=O)oc2c3C=CCOc3ccc12