Reaction Details
TargetCytochrome P450 1A1
LigandBDBM50113271
Substrate/Competitorn/a
Meas. Tech.ChEMBL_1508786 (CHEMBL3603195)
Ki 11600±n/a nM
Citation Liu, JPham, PTSkripnikova, EVZheng, SLovings, LJWang, YGoyal, NBellow, SMMensah, LMChatters, AJBratton, MRWiese, TEZhao, MWang, GForoozesh, M A Ligand-Based Drug Design. Discovery of 4-Trifluoromethyl-7,8-pyranocoumarin as a Selective Inhibitor of Human Cytochrome P450 1A2. J Med Chem58:6481-93 (2015) 
 
Cytochrome P450 1A1
Name:Cytochrome P450 1A1
Type:Protein
Mol. Mass.:58177.23
Organism:Homo sapiens (Human)
Description:P04798
Residue:512
BDBM50113271
NameBDBM50113271
Synonyms:CHEMBL3601508
TypeSmall organic molecule
Emp. Form.C19H14O3
Mol. Mass.290.3127
SMILESCc1cc2c(ccc3c(-c4ccccc4)c(C)c(=O)oc23)o1