Reaction Details
TargetCytochrome P450 1A2
LigandBDBM50113265
Substrate/Competitorn/a
Meas. Tech.ChEMBL_1508787 (CHEMBL3603196)
Ki 1290±n/a nM
Citation Liu, JPham, PTSkripnikova, EVZheng, SLovings, LJWang, YGoyal, NBellow, SMMensah, LMChatters, AJBratton, MRWiese, TEZhao, MWang, GForoozesh, M A Ligand-Based Drug Design. Discovery of 4-Trifluoromethyl-7,8-pyranocoumarin as a Selective Inhibitor of Human Cytochrome P450 1A2. J Med Chem58:6481-93 (2015) 
 
Cytochrome P450 1A2
Name:Cytochrome P450 1A2
Type:Enzyme
Mol. Mass.:58423.38
Organism:Homo sapiens (Human)
Description:P05177
Residue:516
BDBM50113265
NameBDBM50113265
Synonyms:CHEMBL3601437
TypeSmall organic molecule
Emp. Form.C18H12O3
Mol. Mass.276.2861
SMILESO=c1cc(-c2ccccc2)c2ccc3OCC=Cc3c2o1