Reaction Details
TargetCytochrome P450 1A2
LigandBDBM50113272
Substrate/Competitorn/a
Meas. Tech.ChEMBL_1508787 (CHEMBL3603196)
Ki 1150±n/a nM
Citation Liu, JPham, PTSkripnikova, EVZheng, SLovings, LJWang, YGoyal, NBellow, SMMensah, LMChatters, AJBratton, MRWiese, TEZhao, MWang, GForoozesh, M A Ligand-Based Drug Design. Discovery of 4-Trifluoromethyl-7,8-pyranocoumarin as a Selective Inhibitor of Human Cytochrome P450 1A2. J Med Chem58:6481-93 (2015) 
 
Cytochrome P450 1A2
Name:Cytochrome P450 1A2
Type:Enzyme
Mol. Mass.:58423.38
Organism:Homo sapiens (Human)
Description:P05177
Residue:516
BDBM50113272
NameBDBM50113272
Synonyms:CHEBI:82453 | CHEMBL50703
TypeSmall organic molecule
Emp. Form.C13H10O3
Mol. Mass.214.2167
SMILESCc1cc2c(ccc3c(C)cc(=O)oc23)o1