Reaction Details
TargetCytochrome P450 1B1
LigandBDBM50113265
Substrate/Competitorn/a
Meas. Tech.ChEMBL_1508788 (CHEMBL3603197)
Ki 5040±n/a nM
Citation Liu, JPham, PTSkripnikova, EVZheng, SLovings, LJWang, YGoyal, NBellow, SMMensah, LMChatters, AJBratton, MRWiese, TEZhao, MWang, GForoozesh, M A Ligand-Based Drug Design. Discovery of 4-Trifluoromethyl-7,8-pyranocoumarin as a Selective Inhibitor of Human Cytochrome P450 1A2. J Med Chem58:6481-93 (2015) 
 
Cytochrome P450 1B1
Name:Cytochrome P450 1B1
Type:PROTEIN
Mol. Mass.:60861.81
Organism:Homo sapiens (Human)
Description:ChEMBL_1474523
Residue:543
BDBM50113265
NameBDBM50113265
Synonyms:CHEMBL3601437
TypeSmall organic molecule
Emp. Form.C18H12O3
Mol. Mass.276.2861
SMILESO=c1cc(-c2ccccc2)c2ccc3OCC=Cc3c2o1