Reaction Details
TargetCytochrome P450 1B1
LigandBDBM50113274
Substrate/Competitorn/a
Meas. Tech.ChEMBL_1508788 (CHEMBL3603197)
Ki 46600±n/a nM
Citation Liu, JPham, PTSkripnikova, EVZheng, SLovings, LJWang, YGoyal, NBellow, SMMensah, LMChatters, AJBratton, MRWiese, TEZhao, MWang, GForoozesh, M A Ligand-Based Drug Design. Discovery of 4-Trifluoromethyl-7,8-pyranocoumarin as a Selective Inhibitor of Human Cytochrome P450 1A2. J Med Chem58:6481-93 (2015) 
 
Cytochrome P450 1B1
Name:Cytochrome P450 1B1
Type:PROTEIN
Mol. Mass.:60861.81
Organism:Homo sapiens (Human)
Description:ChEMBL_1474523
Residue:543
BDBM50113274
NameBDBM50113274
Synonyms:CHEMBL3601510
TypeSmall organic molecule
Emp. Form.C13H9NO2
Mol. Mass.211.2161
SMILESCc1cc(=O)oc2c1ccc1ncccc21