Reaction Details
TargetCytochrome P450 1A2
LigandBDBM50113259
Substrate/Competitorn/a
Meas. Tech.ChEMBL_1508797 (CHEMBL3603206)
Ki 440±n/a nM
Citation Liu, JPham, PTSkripnikova, EVZheng, SLovings, LJWang, YGoyal, NBellow, SMMensah, LMChatters, AJBratton, MRWiese, TEZhao, MWang, GForoozesh, M A Ligand-Based Drug Design. Discovery of 4-Trifluoromethyl-7,8-pyranocoumarin as a Selective Inhibitor of Human Cytochrome P450 1A2. J Med Chem58:6481-93 (2015) 
 
Cytochrome P450 1A2
Name:Cytochrome P450 1A2
Type:Enzyme
Mol. Mass.:58423.38
Organism:Homo sapiens (Human)
Description:P05177
Residue:516
BDBM50113259
NameBDBM50113259
Synonyms:CHEMBL3601433
TypeSmall organic molecule
Emp. Form.C18H12O3
Mol. Mass.276.2861
SMILESCc1cc2c(ccc3c2oc(cc3=O)-c2ccccc2)o1