Reaction Details
TargetC-C chemokine receptor type 9
LigandBDBM50113352
Substrate/Competitorn/a
Meas. Tech.ChEMBL_1510356 (CHEMBL3607106)
IC50 3.8±n/a nM
Citation Zhang, JRomero, JChan, AGoss, JStucka, SCross, JChamberlain, BVaroglu, MChandonnet, HRyan, DLippa, B Biarylsulfonamide CCR9 inhibitors for inflammatory bowel disease. Bioorg Med Chem Lett25:3661-4 (2015) 
 
C-C chemokine receptor type 9
Name:C-C chemokine receptor type 9
Type:PROTEIN
Mol. Mass.:42023.90
Organism:Homo sapiens (Human)
Description:ChEMBL_1510356
Residue:369
BDBM50113352
NameBDBM50113352
Synonyms:CHEMBL3604487
TypeSmall organic molecule
Emp. Form.C20H21ClN4O2S
Mol. Mass.416.924
SMILESCC(C)(C)c1ccc(cc1)S(=O)(=O)Nc1ccc(Cl)cc1-c1nnccc1N