Reaction Details
TargetC-C chemokine receptor type 9
LigandBDBM50113427
Substrate/Competitorn/a
Meas. Tech.ChEMBL_1510356 (CHEMBL3607106)
IC50 6.0±n/a nM
Citation Zhang, JRomero, JChan, AGoss, JStucka, SCross, JChamberlain, BVaroglu, MChandonnet, HRyan, DLippa, B Biarylsulfonamide CCR9 inhibitors for inflammatory bowel disease. Bioorg Med Chem Lett25:3661-4 (2015) 
 
C-C chemokine receptor type 9
Name:C-C chemokine receptor type 9
Type:PROTEIN
Mol. Mass.:42023.90
Organism:Homo sapiens (Human)
Description:ChEMBL_1510356
Residue:369
BDBM50113427
NameBDBM50113427
Synonyms:CHEMBL3604496
TypeSmall organic molecule
Emp. Form.C22H24ClN3O3S
Mol. Mass.445.962
SMILESCCc1ncnc(c1O)-c1cc(Cl)ccc1NS(=O)(=O)c1ccc(cc1)C(C)(C)C