Reaction Details
TargetC-C chemokine receptor type 9
LigandBDBM50113428
Substrate/Competitorn/a
Meas. Tech.ChEMBL_1510357 (CHEMBL3607107)
IC50 235±n/a nM
Citation Zhang, JRomero, JChan, AGoss, JStucka, SCross, JChamberlain, BVaroglu, MChandonnet, HRyan, DLippa, B Biarylsulfonamide CCR9 inhibitors for inflammatory bowel disease. Bioorg Med Chem Lett25:3661-4 (2015) 
 
C-C chemokine receptor type 9
Name:C-C chemokine receptor type 9
Type:PROTEIN
Mol. Mass.:42023.90
Organism:Homo sapiens (Human)
Description:ChEMBL_1510356
Residue:369
BDBM50113428
NameBDBM50113428
Synonyms:CHEMBL3604497
TypeSmall organic molecule
Emp. Form.C21H23ClN4O2S
Mol. Mass.430.951
SMILESCNc1nccnc1-c1cc(Cl)ccc1NS(=O)(=O)c1ccc(cc1)C(C)(C)C