Reaction Details
TargetC-C chemokine receptor type 9
LigandBDBM50113448
Substrate/Competitorn/a
Meas. Tech.ChEMBL_1510356 (CHEMBL3607106)
IC50 95±n/a nM
Citation Zhang, JRomero, JChan, AGoss, JStucka, SCross, JChamberlain, BVaroglu, MChandonnet, HRyan, DLippa, B Biarylsulfonamide CCR9 inhibitors for inflammatory bowel disease. Bioorg Med Chem Lett25:3661-4 (2015) 
 
C-C chemokine receptor type 9
Name:C-C chemokine receptor type 9
Type:PROTEIN
Mol. Mass.:42023.90
Organism:Homo sapiens (Human)
Description:ChEMBL_1510356
Residue:369
BDBM50113448
NameBDBM50113448
Synonyms:CHEMBL3604477
TypeSmall organic molecule
Emp. Form.C21H22ClN3O2S
Mol. Mass.415.936
SMILESCC(C)(C)c1ccc(cc1)S(=O)(=O)Nc1ccc(Cl)cc1-c1ncccc1N