Reaction Details
TargetPotassium voltage-gated channel subfamily H member 2
LigandBDBM50113476
Substrate/Competitorn/a
Meas. Tech.ChEMBL_1510950 (CHEMBL3606931)
IC50<3162±n/a nM
Citation Christopher, JAAves, SJBennett, KADoré, ASErrey, JCJazayeri, AMarshall, FHOkrasa, KSerrano-Vega, MJTehan, BGWiggin, GRCongreve, M Fragment and Structure-Based Drug Discovery for a Class C GPCR: Discovery of the mGlu5 Negative Allosteric Modulator HTL14242 (3-Chloro-5-[6-(5-fluoropyridin-2-yl)pyrimidin-4-yl]benzonitrile). J Med Chem58:6653-64 (2015) 
 
Potassium voltage-gated channel subfamily H member 2
Name:Potassium voltage-gated channel subfamily H member 2
Type:Multi-pass membrane protein
Mol. Mass.:126672.65
Organism:Homo sapiens (Human)
Description:Q12809
Residue:1159
BDBM50113476
NameBDBM50113476
Synonyms:CHEMBL3603923 US10584111, Ex No. 17 | US11584732, Example 17
TypeSmall organic molecule
Emp. Form.C16H8ClFN4
Mol. Mass.310.713
SMILESFc1ccc(nc1)-c1cc(ncn1)-c1cc(Cl)cc(c1)C#N