Reaction Details
TargetMetabotropic glutamate receptor 5
LigandBDBM50113474
Substrate/Competitorn/a
Meas. Tech.ChEMBL_1510802 (CHEMBL3606566)
Ki 2.5±n/a nM
Citation Christopher, JAAves, SJBennett, KADoré, ASErrey, JCJazayeri, AMarshall, FHOkrasa, KSerrano-Vega, MJTehan, BGWiggin, GRCongreve, M Fragment and Structure-Based Drug Discovery for a Class C GPCR: Discovery of the mGlu5 Negative Allosteric Modulator HTL14242 (3-Chloro-5-[6-(5-fluoropyridin-2-yl)pyrimidin-4-yl]benzonitrile). J Med Chem58:6653-64 (2015) 
 
Metabotropic glutamate receptor 5
Name:Metabotropic glutamate receptor 5
Type:Enzyme
Mol. Mass.:132484.72
Organism:Homo sapiens (Human)
Description:n/a
Residue:1212
BDBM50113474
NameBDBM50113474
Synonyms:CHEMBL3603921 US10584111, Ex No. 19 | US11584732, Example 19
TypeSmall organic molecule
Emp. Form.C17H11ClN4
Mol. Mass.306.749
SMILESCc1ccc(nc1)-c1cc(ncn1)-c1cc(Cl)cc(c1)C#N