Reaction Details
TargetNeuronal acetylcholine receptor subunit alpha-7
LigandBDBM50114003
Substrate/Competitorn/a
Meas. Tech.ChEMBL_1510986 (CHEMBL3607039)
Ki 6100±n/a nM
Citation Bolchi, CValoti, EGotti, CFasoli, FRuggeri, PFumagalli, LBinda, MMucchietto, VSciaccaluga, MBudriesi, RFucile, SPallavicini, M Chemistry and Pharmacology of a Series of Unichiral Analogues of 2-(2-Pyrrolidinyl)-1,4-benzodioxane, Prolinol Phenyl Ether, and Prolinol 3-Pyridyl Ether Designed asa4ß2-Nicotinic Acetylcholine Receptor Agonists. J Med Chem58:6665-77 (2015) 
 
Neuronal acetylcholine receptor subunit alpha-7
Name:Neuronal acetylcholine receptor subunit alpha-7
Type:Enzyme
Mol. Mass.:56502.44
Organism:Rattus norvegicus (Rat)
Description:Q05941
Residue:502
BDBM50114003
NameBDBM50114003
Synonyms:CHEMBL3603948
TypeSmall organic molecule
Emp. Form.C12H18N2O
Mol. Mass.206.2841
SMILES[H][C@]1(CCCN1C)[C@H](C)Oc1cccnc1